Reaction Details
TargetTyrosine-protein phosphatase non-receptor type 1
LigandBDBM50166434
Substrate/Competitorn/a
Meas. Tech.ChEMBL_304766 (CHEMBL829362)
IC50 1608000±n/a nM
Citation Black, EBreed, JBreeze, ALEmbrey, KGarcia, RGero, TWGodfrey, LKenny, PWMorley, ADMinshull, CAPannifer, ADRead, JRees, ARussell, DJToader, DTucker, J Structure-based design of protein tyrosine phosphatase-1B inhibitors. Bioorg Med Chem Lett15:2503-7 (2005) 
 
Tyrosine-protein phosphatase non-receptor type 1
Name:Tyrosine-protein phosphatase non-receptor type 1
Type:Protein phosphatase
Mol. Mass.:49963.76
Organism:Homo sapiens (Human)
Description:Human recombinant GST-fusion PTP1B (1-435).
Residue:435
BDBM50166434
NameBDBM50166434
Synonyms:1,1-Dioxo-5-phenyl-1lambda*6*-[1,2,5]thiadiazolidin-3-one CHEMBL190801
TypeSmall organic molecule
Emp. Form.C8H8N2O3S
Mol. Mass.212.226
SMILESO=C1CN(c2ccccc2)S(=O)(=O)N1