Reaction Details
TargetG protein-activated inward rectifier potassium channel 4
LigandBDBM50593371
Substrate/Competitorn/a
Meas. Tech.ChEMBL_2208083 (CHEMBL5121032)
EC50 720±n/a nM
Citation Sharma, SLesiak, LAretz, CDDu, YKumar, SGautam, NAlnouti, YDhuria, NVChhonker, YSWeaver, CDHopkins, CR Discovery, synthesis and biological characterization of a series of  RSC Med Chem12:1366-1373 (2021) 
 
G protein-activated inward rectifier potassium channel 4
Name:G protein-activated inward rectifier potassium channel 4
Type:PROTEIN
Mol. Mass.:47658.06
Organism:Homo sapiens (Human)
Description:ChEMBL_107914
Residue:419
BDBM50593371
NameBDBM50593371
Synonyms:CHEMBL5189637
TypeSmall organic molecule
Emp. Form.C18H21ClFN3O
Mol. Mass.349.83
SMILESCc1cc(NC(=O)Cc2ccc(F)c(Cl)c2)n(n1)C1CCCCC1