Reaction Details
TargetG protein-activated inward rectifier potassium channel 4
LigandBDBM50593387
Substrate/Competitorn/a
Meas. Tech.ChEMBL_2208083 (CHEMBL5121032)
EC50 730±n/a nM
Citation Sharma, SLesiak, LAretz, CDDu, YKumar, SGautam, NAlnouti, YDhuria, NVChhonker, YSWeaver, CDHopkins, CR Discovery, synthesis and biological characterization of a series of  RSC Med Chem12:1366-1373 (2021) 
 
G protein-activated inward rectifier potassium channel 4
Name:G protein-activated inward rectifier potassium channel 4
Type:PROTEIN
Mol. Mass.:47658.06
Organism:Homo sapiens (Human)
Description:ChEMBL_107914
Residue:419
BDBM50593387
NameBDBM50593387
Synonyms:CHEMBL5187664
TypeSmall organic molecule
Emp. Form.C18H17F6N3O4S
Mol. Mass.485.401
SMILESCc1cc(NC(=O)COc2ccc(cc2C(F)(F)F)C(F)(F)F)n(n1)C1CCS(=O)(=O)C1