Reaction Details
TargetG protein-activated inward rectifier potassium channel 4
LigandBDBM50593401
Substrate/Competitorn/a
Meas. Tech.ChEMBL_2208083 (CHEMBL5121032)
EC50 607±n/a nM
Citation Sharma, SLesiak, LAretz, CDDu, YKumar, SGautam, NAlnouti, YDhuria, NVChhonker, YSWeaver, CDHopkins, CR Discovery, synthesis and biological characterization of a series of  RSC Med Chem12:1366-1373 (2021) 
 
G protein-activated inward rectifier potassium channel 4
Name:G protein-activated inward rectifier potassium channel 4
Type:PROTEIN
Mol. Mass.:47658.06
Organism:Homo sapiens (Human)
Description:ChEMBL_107914
Residue:419
BDBM50593401
NameBDBM50593401
Synonyms:CHEMBL5192503
TypeSmall organic molecule
Emp. Form.C15H17Cl2N3O2
Mol. Mass.342.22
SMILESCC(C)n1nc(C)cc1NC(=O)COc1ccc(Cl)cc1Cl