Reaction Details
TargetG protein-activated inward rectifier potassium channel 4
LigandBDBM50593405
Substrate/Competitorn/a
Meas. Tech.ChEMBL_2208083 (CHEMBL5121032)
EC50 145±n/a nM
Citation Sharma, SLesiak, LAretz, CDDu, YKumar, SGautam, NAlnouti, YDhuria, NVChhonker, YSWeaver, CDHopkins, CR Discovery, synthesis and biological characterization of a series of  RSC Med Chem12:1366-1373 (2021) 
 
G protein-activated inward rectifier potassium channel 4
Name:G protein-activated inward rectifier potassium channel 4
Type:PROTEIN
Mol. Mass.:47658.06
Organism:Homo sapiens (Human)
Description:ChEMBL_107914
Residue:419
BDBM50593405
NameBDBM50593405
Synonyms:CHEMBL5178783
TypeSmall organic molecule
Emp. Form.C18H19Cl2F2N3O2
Mol. Mass.418.265
SMILESCc1cc(NC(=O)COc2ccc(Cl)cc2Cl)n(n1)C1CCC(F)(F)CC1