Reaction Details
TargetG protein-activated inward rectifier potassium channel 4
LigandBDBM50593406
Substrate/Competitorn/a
Meas. Tech.ChEMBL_2208083 (CHEMBL5121032)
EC50 371±n/a nM
Citation Sharma, SLesiak, LAretz, CDDu, YKumar, SGautam, NAlnouti, YDhuria, NVChhonker, YSWeaver, CDHopkins, CR Discovery, synthesis and biological characterization of a series of  RSC Med Chem12:1366-1373 (2021) 
 
G protein-activated inward rectifier potassium channel 4
Name:G protein-activated inward rectifier potassium channel 4
Type:PROTEIN
Mol. Mass.:47658.06
Organism:Homo sapiens (Human)
Description:ChEMBL_107914
Residue:419
BDBM50593406
NameBDBM50593406
Synonyms:CHEMBL5206362
TypeSmall organic molecule
Emp. Form.C17H19Cl2N3O3
Mol. Mass.384.257
SMILESCc1cc(NC(=O)COc2ccc(Cl)cc2Cl)n(n1)C1CCOCC1