Reaction Details
TargetDelta-type opioid receptor
LigandBDBM50166636
Substrate/Competitorn/a
Meas. Tech.ChEMBL_303005 (CHEMBL830244)
Ki 55±n/a nM
Citation Le Bourdonnec, BAjello, CWSeida, PRSusnow, RGCassel, JABelanger, SStabley, GJDeHaven, RNDeHaven-Hudkins, DLDolle, RE Arylacetamide kappa opioid receptor agonists with reduced cytochrome P450 2D6 inhibitory activity. Bioorg Med Chem Lett15:2647-52 (2005) 
 
Delta-type opioid receptor
Name:Delta-type opioid receptor
Type:G Protein-Coupled Receptor (GPCR)
Mol. Mass.:40382.98
Organism:Homo sapiens (Human)
Description:Competition binding assays were carried out using membrane preparations from transfected HN9.10 cells that constitutively expressed the delta opioid receptor.
Residue:372
BDBM50166636
NameBDBM50166636
Synonyms:CHEMBL370538 | N-[(S)-2-((S)-3-Hydroxy-pyrrolidin-1-yl)-1-phenyl-ethyl]-N-methyl-2-{4-[(thiophen-2-ylmethanesulfonylamino)-methyl]-phenyl}-acetamide
TypeSmall organic molecule
Emp. Form.C27H33N3O4S2
Mol. Mass.527.699
SMILESCN([C@H](CN1CC[C@H](O)C1)c1ccccc1)C(=O)Cc1ccc(CNS(=O)(=O)Cc2cccs2)cc1