Reaction Details
TargetKappa-type opioid receptor
LigandBDBM50166620
Substrate/Competitorn/a
Meas. Tech.ChEMBL_304359 (CHEMBL839788)
EC50 5.7±n/a nM
Citation Le Bourdonnec, BAjello, CWSeida, PRSusnow, RGCassel, JABelanger, SStabley, GJDeHaven, RNDeHaven-Hudkins, DLDolle, RE Arylacetamide kappa opioid receptor agonists with reduced cytochrome P450 2D6 inhibitory activity. Bioorg Med Chem Lett15:2647-52 (2005) 
 
Kappa-type opioid receptor
Name:Kappa-type opioid receptor
Type:G Protein-Coupled Receptor (GPCR)
Mol. Mass.:42648.76
Organism:Homo sapiens (Human)
Description:P41145
Residue:380
BDBM50166620
NameBDBM50166620
Synonyms:2-[4-(Methanesulfonylamino-methyl)-phenyl]-N-methyl-N-((S)-1-phenyl-2-pyrrolidin-1-yl-ethyl)-acetamide | CHEMBL189683
TypeSmall organic molecule
Emp. Form.C23H31N3O3S
Mol. Mass.429.576
SMILESCN([C@H](CN1CCCC1)c1ccccc1)C(=O)Cc1ccc(CNS(C)(=O)=O)cc1