Reaction Details
TargetKappa-type opioid receptor
LigandBDBM50039966
Substrate/Competitorn/a
Meas. Tech.ChEMBL_302970 (CHEMBL827950)
Ki 5.8±n/a nM
Citation Le Bourdonnec, BAjello, CWSeida, PRSusnow, RGCassel, JABelanger, SStabley, GJDeHaven, RNDeHaven-Hudkins, DLDolle, RE Arylacetamide kappa opioid receptor agonists with reduced cytochrome P450 2D6 inhibitory activity. Bioorg Med Chem Lett15:2647-52 (2005) 
 
Kappa-type opioid receptor
Name:Kappa-type opioid receptor
Type:G Protein-Coupled Receptor (GPCR)
Mol. Mass.:42648.76
Organism:Homo sapiens (Human)
Description:P41145
Residue:380
BDBM50039966
NameBDBM50039966
Synonyms:1-[(S)-2-(Methyl-phenylacetyl-amino)-2-phenyl-ethyl]-pyrrolidinium N-Methyl-2-phenyl-N-((S)-1-phenyl-2-pyrrolidin-1-yl-ethyl)-acetamide
TypeSmall organic molecule
Emp. Form.C21H26N2O
Mol. Mass.322.4439
SMILESCN([C@H](CN1CCCC1)c1ccccc1)C(=O)Cc1ccccc1