Reaction Details
TargetDelta-type opioid receptor
LigandBDBM50166615
Substrate/Competitorn/a
Meas. Tech.ChEMBL_303005 (CHEMBL830244)
Ki 513±n/a nM
Citation Le Bourdonnec, BAjello, CWSeida, PRSusnow, RGCassel, JABelanger, SStabley, GJDeHaven, RNDeHaven-Hudkins, DLDolle, RE Arylacetamide kappa opioid receptor agonists with reduced cytochrome P450 2D6 inhibitory activity. Bioorg Med Chem Lett15:2647-52 (2005) 
 
Delta-type opioid receptor
Name:Delta-type opioid receptor
Type:G Protein-Coupled Receptor (GPCR)
Mol. Mass.:40382.98
Organism:Homo sapiens (Human)
Description:Competition binding assays were carried out using membrane preparations from transfected HN9.10 cells that constitutively expressed the delta opioid receptor.
Residue:372
BDBM50166615
NameBDBM50166615
Synonyms:2-[4-(Ethanesulfonylamino-methyl)-phenyl]-N-[(S)-2-((S)-3-hydroxy-pyrrolidin-1-yl)-1-phenyl-ethyl]-N-methyl-acetamide | CHEMBL190766
TypeSmall organic molecule
Emp. Form.C24H33N3O4S
Mol. Mass.459.602
SMILESCCS(=O)(=O)NCc1ccc(CC(=O)N(C)[C@H](CN2CC[C@H](O)C2)c2ccccc2)cc1