Reaction Details
TargetKappa-type opioid receptor
LigandBDBM50166617
Substrate/Competitorn/a
Meas. Tech.ChEMBL_304359 (CHEMBL839788)
EC50 22±n/a nM
Citation Le Bourdonnec, BAjello, CWSeida, PRSusnow, RGCassel, JABelanger, SStabley, GJDeHaven, RNDeHaven-Hudkins, DLDolle, RE Arylacetamide kappa opioid receptor agonists with reduced cytochrome P450 2D6 inhibitory activity. Bioorg Med Chem Lett15:2647-52 (2005) 
 
Kappa-type opioid receptor
Name:Kappa-type opioid receptor
Type:G Protein-Coupled Receptor (GPCR)
Mol. Mass.:42648.76
Organism:Homo sapiens (Human)
Description:P41145
Residue:380
BDBM50166617
NameBDBM50166617
Synonyms:2-{4-[(4-Fluoro-benzenesulfonylamino)-methyl]-phenyl}-N-[(S)-2-((S)-3-hydroxy-pyrrolidin-1-yl)-1-phenyl-ethyl]-N-methyl-acetamide | CHEMBL190353
TypeSmall organic molecule
Emp. Form.C28H32FN3O4S
Mol. Mass.525.635
SMILESCN([C@H](CN1CC[C@H](O)C1)c1ccccc1)C(=O)Cc1ccc(CNS(=O)(=O)c2ccc(F)cc2)cc1