Reaction Details
TargetMu-type opioid receptor
LigandBDBM50166614
Substrate/Competitorn/a
Meas. Tech.ChEMBL_302965 (CHEMBL827945)
Ki 478.0±n/a nM
Citation Le Bourdonnec, BAjello, CWSeida, PRSusnow, RGCassel, JABelanger, SStabley, GJDeHaven, RNDeHaven-Hudkins, DLDolle, RE Arylacetamide kappa opioid receptor agonists with reduced cytochrome P450 2D6 inhibitory activity. Bioorg Med Chem Lett15:2647-52 (2005) 
 
Mu-type opioid receptor
Name:Mu-type opioid receptor
Type:G Protein-Coupled Receptor (GPCR)
Mol. Mass.:44789.51
Organism:Homo sapiens (Human)
Description:P35372
Residue:400
BDBM50166614
NameBDBM50166614
Synonyms:CHEMBL189643 | N-[(S)-2-((S)-3-Hydroxy-pyrrolidin-1-yl)-1-phenyl-ethyl]-N-methyl-2-[4-(phenylmethanesulfonylamino-methyl)-phenyl]-acetamide
TypeSmall organic molecule
Emp. Form.C29H35N3O4S
Mol. Mass.521.671
SMILESCN([C@H](CN1CC[C@H](O)C1)c1ccccc1)C(=O)Cc1ccc(CNS(=O)(=O)Cc2ccccc2)cc1