Reaction Details
TargetKappa-type opioid receptor
LigandBDBM50166621
Substrate/Competitorn/a
Meas. Tech.ChEMBL_302970 (CHEMBL827950)
EC50 0.200000±n/a nM
Citation Le Bourdonnec, BAjello, CWSeida, PRSusnow, RGCassel, JABelanger, SStabley, GJDeHaven, RNDeHaven-Hudkins, DLDolle, RE Arylacetamide kappa opioid receptor agonists with reduced cytochrome P450 2D6 inhibitory activity. Bioorg Med Chem Lett15:2647-52 (2005) 
 
Kappa-type opioid receptor
Name:Kappa-type opioid receptor
Type:G Protein-Coupled Receptor (GPCR)
Mol. Mass.:42648.76
Organism:Homo sapiens (Human)
Description:P41145
Residue:380
BDBM50166621
NameBDBM50166621
Synonyms:CHEMBL191987 | N-[(S)-2-((S)-3-Hydroxy-pyrrolidin-1-yl)-1-phenyl-ethyl]-2-(4-methanesulfonylamino-phenyl)-N-methyl-acetamide
TypeSmall organic molecule
Emp. Form.C22H29N3O4S
Mol. Mass.431.548
SMILESCN([C@H](CN1CC[C@H](O)C1)c1ccccc1)C(=O)Cc1ccc(NS(C)(=O)=O)cc1