Reaction Details
TargetMu-type opioid receptor
LigandBDBM50166622
Substrate/Competitorn/a
Meas. Tech.ChEMBL_302965 (CHEMBL827945)
Ki 1900±n/a nM
Citation Le Bourdonnec, BAjello, CWSeida, PRSusnow, RGCassel, JABelanger, SStabley, GJDeHaven, RNDeHaven-Hudkins, DLDolle, RE Arylacetamide kappa opioid receptor agonists with reduced cytochrome P450 2D6 inhibitory activity. Bioorg Med Chem Lett15:2647-52 (2005) 
 
Mu-type opioid receptor
Name:Mu-type opioid receptor
Type:G Protein-Coupled Receptor (GPCR)
Mol. Mass.:44789.51
Organism:Homo sapiens (Human)
Description:P35372
Residue:400
BDBM50166622
NameBDBM50166622
Synonyms:2-[3-(Methanesulfonylamino-methyl)-phenyl]-N-methyl-N-((S)-1-phenyl-2-pyrrolidin-1-yl-ethyl)-acetamide | CHEMBL190030
TypeSmall organic molecule
Emp. Form.C23H31N3O3S
Mol. Mass.429.576
SMILESCN([C@H](CN1CCCC1)c1ccccc1)C(=O)Cc1cccc(CNS(C)(=O)=O)c1