Reaction Details
TargetCytochrome P450 2D6
LigandBDBM50166634
Substrate/Competitorn/a
Meas. Tech.ChEMBL_306014 (CHEMBL874551)
IC50 107±n/a nM
Citation Le Bourdonnec, BAjello, CWSeida, PRSusnow, RGCassel, JABelanger, SStabley, GJDeHaven, RNDeHaven-Hudkins, DLDolle, RE Arylacetamide kappa opioid receptor agonists with reduced cytochrome P450 2D6 inhibitory activity. Bioorg Med Chem Lett15:2647-52 (2005) 
 
Cytochrome P450 2D6
Name:Cytochrome P450 2D6
Type:Protein
Mol. Mass.:55774.82
Organism:Homo sapiens (Human)
Description:P10635
Residue:497
BDBM50166634
NameBDBM50166634
Synonyms:2-(3-Aminomethyl-phenyl)-N-methyl-N-((S)-1-phenyl-2-pyrrolidin-1-yl-ethyl)-acetamide | CHEMBL192734
TypeSmall organic molecule
Emp. Form.C22H29N3O
Mol. Mass.351.4852
SMILESCN([C@H](CN1CCCC1)c1ccccc1)C(=O)Cc1cccc(CN)c1