Reaction Details
TargetKappa-type opioid receptor
LigandBDBM50166624
Substrate/Competitorn/a
Meas. Tech.ChEMBL_302970 (CHEMBL827950)
Ki 2.7±n/a nM
Citation Le Bourdonnec, BAjello, CWSeida, PRSusnow, RGCassel, JABelanger, SStabley, GJDeHaven, RNDeHaven-Hudkins, DLDolle, RE Arylacetamide kappa opioid receptor agonists with reduced cytochrome P450 2D6 inhibitory activity. Bioorg Med Chem Lett15:2647-52 (2005) 
 
Kappa-type opioid receptor
Name:Kappa-type opioid receptor
Type:G Protein-Coupled Receptor (GPCR)
Mol. Mass.:42648.76
Organism:Homo sapiens (Human)
Description:P41145
Residue:380
BDBM50166624
NameBDBM50166624
Synonyms:CHEMBL447185 | N-[(S)-2-((S)-3-Hydroxy-pyrrolidin-1-yl)-1-phenyl-ethyl]-N-methyl-2-{4-[(propane-2-sulfonylamino)-methyl]-phenyl}-acetamide
TypeSmall organic molecule
Emp. Form.C25H35N3O4S
Mol. Mass.473.628
SMILESCC(C)S(=O)(=O)NCc1ccc(CC(=O)N(C)[C@H](CN2CC[C@H](O)C2)c2ccccc2)cc1