Reaction Details
TargetEstrogen receptor
LigandBDBM50593462
Substrate/Competitorn/a
Meas. Tech.ChEMBL_2208247 (CHEMBL5121196)
IC50 0.330000±n/a nM
Citation Kurtanovi?, NToma?evi?, NMati?, SMitrovi?, MMKosti?, DASabatino, MAntonini, LRagno, RMladenovi?, M Human estrogen receptor ? antagonists, part 2: Synthesis driven by rational design, in vitro antiproliferative, and in vivo anticancer evaluation of innovative coumarin-related antiestrogens as breast cancer suppressants. Eur J Med Chem227:0 (2022) 
 
Estrogen receptor
Name:Estrogen receptor
Type:Protein
Mol. Mass.:66230.44
Organism:Homo sapiens (Human)
Description:P03372
Residue:595
BDBM50593462
NameBDBM50593462
Synonyms:CHEMBL5178058
TypeSmall organic molecule
Emp. Form.C24H21N3O5
Mol. Mass.431.4406
SMILESCNCCOc1ccc(cc1)N1Nc2cc(O)ccc2-c2c1c1ccc(O)cc1oc2=O