Reaction Details
TargetEstrogen receptor
LigandBDBM50593471
Substrate/Competitorn/a
Meas. Tech.ChEMBL_2208247 (CHEMBL5121196)
IC50 0.390000±n/a nM
Citation Kurtanovi?, NToma?evi?, NMati?, SMitrovi?, MMKosti?, DASabatino, MAntonini, LRagno, RMladenovi?, M Human estrogen receptor ? antagonists, part 2: Synthesis driven by rational design, in vitro antiproliferative, and in vivo anticancer evaluation of innovative coumarin-related antiestrogens as breast cancer suppressants. Eur J Med Chem227:0 (2022) 
 
Estrogen receptor
Name:Estrogen receptor
Type:Protein
Mol. Mass.:66230.44
Organism:Homo sapiens (Human)
Description:P03372
Residue:595
BDBM50593471
NameBDBM50593471
Synonyms:CHEMBL5195371
TypeSmall organic molecule
Emp. Form.C24H20N2O8S
Mol. Mass.496.489
SMILESNc1ccc(cc1)-c1c(C(=O)c2ccc(OCCNS(O)(=O)=O)cc2)c2ccc(O)cc2oc1=O