Reaction Details
TargetSodium channel protein type 9 subunit alpha
LigandBDBM50166788
Substrate/Competitorn/a
Meas. Tech.ChEMBL_306458 (CHEMBL829535)
IC50 3800±n/a nM
Citation Liang, JBrochu, RMCohen, CJDick, IEFelix, JPFisher, MHGarcia, MLKaczorowski, GJLyons, KAMeinke, PTPriest, BTSchmalhofer, WASmith, MMTarpley, JWWilliams, BSMartin, WJParsons, WH Discovery of potent and use-dependent sodium channel blockers for treatment of chronic pain. Bioorg Med Chem Lett15:2943-7 (2005) 
 
Sodium channel protein type 9 subunit alpha
Name:Sodium channel protein type 9 subunit alpha
Type:Protein
Mol. Mass.:226375.97
Organism:Homo sapiens (Human)
Description:Q15858
Residue:1988
BDBM50166788
NameBDBM50166788
Synonyms:1-{2-[2-(4-Chloro-phenyl)-thiazol-4-ylmethoxy]-3-methoxy-benzyl}-azocane | CHEMBL197304
TypeSmall organic molecule
Emp. Form.C25H29ClN2O2S
Mol. Mass.457.028
SMILESCOc1cccc(CN2CCCCCCC2)c1OCc1csc(n1)-c1ccc(Cl)cc1