Reaction Details
TargetSodium channel protein type 9 subunit alpha
LigandBDBM50166787
Substrate/Competitorn/a
Meas. Tech.ChEMBL_306458 (CHEMBL829535)
IC50 1000±n/a nM
Citation Liang, JBrochu, RMCohen, CJDick, IEFelix, JPFisher, MHGarcia, MLKaczorowski, GJLyons, KAMeinke, PTPriest, BTSchmalhofer, WASmith, MMTarpley, JWWilliams, BSMartin, WJParsons, WH Discovery of potent and use-dependent sodium channel blockers for treatment of chronic pain. Bioorg Med Chem Lett15:2943-7 (2005) 
 
Sodium channel protein type 9 subunit alpha
Name:Sodium channel protein type 9 subunit alpha
Type:Protein
Mol. Mass.:226375.97
Organism:Homo sapiens (Human)
Description:Q15858
Residue:1988
BDBM50166787
NameBDBM50166787
Synonyms:CHEMBL195235 | {2-[2-(4-Chloro-phenyl)-thiazol-4-ylmethoxy]-phenyl}-pyrrolidin-1-yl-methanone
TypeSmall organic molecule
Emp. Form.C21H19ClN2O2S
Mol. Mass.398.906
SMILESClc1ccc(cc1)-c1nc(COc2ccccc2C(=O)N2CCCC2)cs1