Reaction Details
TargetPotassium voltage-gated channel subfamily H member 2
LigandBDBM50166787
Substrate/Competitorn/a
Meas. Tech.ChEMBL_306290 (CHEMBL828432)
IC50 9800.0±n/a nM
Citation Liang, JBrochu, RMCohen, CJDick, IEFelix, JPFisher, MHGarcia, MLKaczorowski, GJLyons, KAMeinke, PTPriest, BTSchmalhofer, WASmith, MMTarpley, JWWilliams, BSMartin, WJParsons, WH Discovery of potent and use-dependent sodium channel blockers for treatment of chronic pain. Bioorg Med Chem Lett15:2943-7 (2005) 
 
Potassium voltage-gated channel subfamily H member 2
Name:Potassium voltage-gated channel subfamily H member 2
Type:Multi-pass membrane protein
Mol. Mass.:126672.65
Organism:Homo sapiens (Human)
Description:Q12809
Residue:1159
BDBM50166787
NameBDBM50166787
Synonyms:CHEMBL195235 | {2-[2-(4-Chloro-phenyl)-thiazol-4-ylmethoxy]-phenyl}-pyrrolidin-1-yl-methanone
TypeSmall organic molecule
Emp. Form.C21H19ClN2O2S
Mol. Mass.398.906
SMILESClc1ccc(cc1)-c1nc(COc2ccccc2C(=O)N2CCCC2)cs1