Reaction Details
TargetPotassium voltage-gated channel subfamily H member 2
LigandBDBM50166790
Substrate/Competitorn/a
Meas. Tech.ChEMBL_306311 (CHEMBL827704)
IC50 7700±n/a nM
Citation Liang, JBrochu, RMCohen, CJDick, IEFelix, JPFisher, MHGarcia, MLKaczorowski, GJLyons, KAMeinke, PTPriest, BTSchmalhofer, WASmith, MMTarpley, JWWilliams, BSMartin, WJParsons, WH Discovery of potent and use-dependent sodium channel blockers for treatment of chronic pain. Bioorg Med Chem Lett15:2943-7 (2005) 
 
Potassium voltage-gated channel subfamily H member 2
Name:Potassium voltage-gated channel subfamily H member 2
Type:Multi-pass membrane protein
Mol. Mass.:126672.65
Organism:Homo sapiens (Human)
Description:Q12809
Residue:1159
BDBM50166790
NameBDBM50166790
Synonyms:CHEMBL364912 | {2-[2-(4-Chloro-phenyl)-thiazol-4-ylmethoxy]-3-methoxy-phenyl}-pyrrolidin-1-yl-methanone
TypeSmall organic molecule
Emp. Form.C22H21ClN2O3S
Mol. Mass.428.932
SMILESCOc1cccc(C(=O)N2CCCC2)c1OCc1csc(n1)-c1ccc(Cl)cc1