Reaction Details
TargetAcetylcholinesterase
LigandBDBM50004000
Substrate/Competitorn/a
Meas. Tech.ChEMBL_304873 (CHEMBL829249)
IC50 30±n/a nM
Citation Bianchi, DAHirschmann, GSTheoduloz, CBracca, ABKaufman, TS Synthesis of tricyclic analogs of stephaoxocanidine and their evaluation as acetylcholinesterase inhibitors. Bioorg Med Chem Lett15:2711-5 (2005) 
 
Acetylcholinesterase
Name:Acetylcholinesterase
Type:Enzyme
Mol. Mass.:67792.70
Organism:Homo sapiens (Human)
Description:P22303
Residue:614
BDBM50004000
NameBDBM50004000
Synonyms:(3aS,8aR)-1,3a,8-trimethyl-1,2,3,3a,8,8a-hexahydropyrrolo[2,3-b]indol-5-yl methylcarbamate CHEMBL94 Physostol | physostigmine
TypeSmall organic molecule
Emp. Form.C15H21N3O2
Mol. Mass.275.3461
SMILESCNC(=O)Oc1ccc2N(C)[C@H]3N(C)CC[C@@]3(C)c2c1