Reaction Details
TargetHepatocyte growth factor receptor
LigandBDBM50146168
Substrate/Competitorn/a
Meas. Tech.ChEMBL_2209350 (CHEMBL5122299)
IC50 360±n/a nM
Citation Pan, YMader, MM Principles of Kinase Allosteric Inhibition and Pocket Validation. J Med Chem65:5288-5299 (2022) 
 
Hepatocyte growth factor receptor
Name:Hepatocyte growth factor receptor
Type:Protein
Mol. Mass.:155559.73
Organism:Homo sapiens (Human)
Description:P08581
Residue:1390
BDBM50146168
NameBDBM50146168
Synonyms:ARQ-197 | Tivantinib
TypeSmall organic molecule
Emp. Form.C23H19N3O2
Mol. Mass.369.4159
SMILESO=C1NC(=O)[C@H]([C@@H]1c1c[nH]c2ccccc12)c1cn2CCCc3cccc1c23