Reaction Details
TargetCarbonic anhydrase 1
LigandBDBM50167401
Substrate/Competitorn/a
Meas. Tech.ChEMBL_302503 (CHEMBL828219)
Ki 51±n/a nM
Citation Puccetti, LFasolis, GVullo, DChohan, ZHScozzafava, ASupuran, CT Carbonic anhydrase inhibitors. Inhibition of cytosolic/tumor-associated carbonic anhydrase isozymes I, II, IX, and XII with Schiff's bases incorporating chromone and aromatic sulfonamide moieties, and their zinc complexes. Bioorg Med Chem Lett15:3096-101 (2005) 
 
Carbonic anhydrase 1
Name:Carbonic anhydrase 1
Type:Enzyme
Mol. Mass.:28873.37
Organism:Homo sapiens (Human)
Description:P00915
Residue:261
BDBM50167401
NameBDBM50167401
Synonyms:CHEMBL193432 | sulfanilamide derivative
TypeSmall organic molecule
Emp. Form.C38H38Cl2N4O8S2Zn
Mol. Mass.879.174
SMILESCc1ccc2OC=C3C=[N+](CCc4ccc(cc4)S(N)(=O)=O)[Zn]4(Cl)(Cl)(OC3c2c1)OC1C(=COc2ccc(C)cc12)C=[N+]4CCc1ccc(cc1)S(N)(=O)=O