Reaction Details
TargetCarbonic anhydrase 1
LigandBDBM50167413
Substrate/Competitorn/a
Meas. Tech.ChEMBL_302503 (CHEMBL828219)
Ki 15±n/a nM
Citation Puccetti, LFasolis, GVullo, DChohan, ZHScozzafava, ASupuran, CT Carbonic anhydrase inhibitors. Inhibition of cytosolic/tumor-associated carbonic anhydrase isozymes I, II, IX, and XII with Schiff's bases incorporating chromone and aromatic sulfonamide moieties, and their zinc complexes. Bioorg Med Chem Lett15:3096-101 (2005) 
 
Carbonic anhydrase 1
Name:Carbonic anhydrase 1
Type:Enzyme
Mol. Mass.:28873.37
Organism:Homo sapiens (Human)
Description:P00915
Residue:261
BDBM50167413
NameBDBM50167413
Synonyms:CHEMBL372750 | sulfanilamide derivative
TypeSmall organic molecule
Emp. Form.C36H36Cl2N4O8S2Zn
Mol. Mass.853.138
SMILESNS(=O)(=O)c1ccc(CCN2CC3=COc4ccccc4C3O[Zn]22(Cl)(Cl)OC3C(CN2CCc2ccc(cc2)S(N)(=O)=O)=COc2ccccc32)cc1