Reaction Details
TargetCarbonic anhydrase 9
LigandBDBM50167403
Substrate/Competitorn/a
Meas. Tech.ChEMBL_302532 (CHEMBL827384)
Ki>1000±n/a nM
Citation Puccetti, LFasolis, GVullo, DChohan, ZHScozzafava, ASupuran, CT Carbonic anhydrase inhibitors. Inhibition of cytosolic/tumor-associated carbonic anhydrase isozymes I, II, IX, and XII with Schiff's bases incorporating chromone and aromatic sulfonamide moieties, and their zinc complexes. Bioorg Med Chem Lett15:3096-101 (2005) 
 
Carbonic anhydrase 9
Name:Carbonic anhydrase 9
Type:Enzyme
Mol. Mass.:49669.03
Organism:Homo sapiens (Human)
Description:Catalytic domain of human cloned isozyme was used in the assay
Residue:459
BDBM50167403
NameBDBM50167403
Synonyms:CHEMBL369922 | sulfanilamide derivative
TypeSmall organic molecule
Emp. Form.C32H26Cl2N4O8S2Zn
Mol. Mass.795.015
SMILESNS(=O)(=O)c1ccc(cc1)[N+]1=CC2=COc3ccccc3C2O[Zn]11(Cl)(Cl)OC2C(=COc3ccccc23)C=[N+]1c1ccc(cc1)S(N)(=O)=O