Reaction Details
TargetCarbonic anhydrase 1
LigandBDBM50167409
Substrate/Competitorn/a
Meas. Tech.ChEMBL_302503 (CHEMBL828219)
Ki>1000±n/a nM
Citation Puccetti, LFasolis, GVullo, DChohan, ZHScozzafava, ASupuran, CT Carbonic anhydrase inhibitors. Inhibition of cytosolic/tumor-associated carbonic anhydrase isozymes I, II, IX, and XII with Schiff's bases incorporating chromone and aromatic sulfonamide moieties, and their zinc complexes. Bioorg Med Chem Lett15:3096-101 (2005) 
 
Carbonic anhydrase 1
Name:Carbonic anhydrase 1
Type:Enzyme
Mol. Mass.:28873.37
Organism:Homo sapiens (Human)
Description:P00915
Residue:261
BDBM50167409
NameBDBM50167409
Synonyms:1N-amino(imino)methyl-4-[1-(4-oxo-4H-3-chromenyl)-(E)-methylideneamino]-1-benzenesulfonamide | CHEMBL370790
TypeSmall organic molecule
Emp. Form.C17H14N4O4S
Mol. Mass.370.382
SMILESNC(=N)NS(=O)(=O)c1ccc(cc1)\N=C\c1coc2ccccc2c1=O