Reaction Details
TargetCarbonic anhydrase 2
LigandBDBM50167408
Substrate/Competitorn/a
Meas. Tech.ChEMBL_302531 (CHEMBL827383)
Ki 14±n/a nM
Citation Puccetti, LFasolis, GVullo, DChohan, ZHScozzafava, ASupuran, CT Carbonic anhydrase inhibitors. Inhibition of cytosolic/tumor-associated carbonic anhydrase isozymes I, II, IX, and XII with Schiff's bases incorporating chromone and aromatic sulfonamide moieties, and their zinc complexes. Bioorg Med Chem Lett15:3096-101 (2005) 
 
Carbonic anhydrase 2
Name:Carbonic anhydrase 2
Type:Enzyme
Mol. Mass.:29250.71
Organism:Homo sapiens (Human)
Description:P00918
Residue:260
BDBM50167408
NameBDBM50167408
Synonyms:4-(((4-oxo-4H-chromen-3-yl)methyleneamino)methyl)benzenesulfonamide CHEMBL197104
TypeSmall organic molecule
Emp. Form.C17H14N2O4S
Mol. Mass.342.369
SMILESNS(=O)(=O)c1ccc(C\N=C\c2coc3ccccc3c2=O)cc1