Reaction Details
TargetCarbonic anhydrase 12
LigandBDBM50167421
Substrate/Competitorn/a
Meas. Tech.ChEMBL_302561 (CHEMBL839523)
Ki 17±n/a nM
Citation Puccetti, LFasolis, GVullo, DChohan, ZHScozzafava, ASupuran, CT Carbonic anhydrase inhibitors. Inhibition of cytosolic/tumor-associated carbonic anhydrase isozymes I, II, IX, and XII with Schiff's bases incorporating chromone and aromatic sulfonamide moieties, and their zinc complexes. Bioorg Med Chem Lett15:3096-101 (2005) 
 
Carbonic anhydrase 12
Name:Carbonic anhydrase 12
Type:Enzyme
Mol. Mass.:39456.00
Organism:Homo sapiens (Human)
Description:Catalytic domain of human cloned isozyme was used in the assay
Residue:354
BDBM50167421
NameBDBM50167421
Synonyms:CHEMBL370172 | sulfanilamide derivative
TypeSmall organic molecule
Emp. Form.C32H28Cl2N4O8S2Zn
Mol. Mass.797.032
SMILESNS(=O)(=O)c1ccc(cc1)N1CC2=COc3ccccc3C2O[Zn]11(Cl)(Cl)OC2C(CN1c1ccc(cc1)S(N)(=O)=O)=COc1ccccc21