Reaction Details
TargetCarbonic anhydrase 1
LigandBDBM50167423
Substrate/Competitorn/a
Meas. Tech.ChEMBL_302503 (CHEMBL828219)
Ki 85±n/a nM
Citation Puccetti, LFasolis, GVullo, DChohan, ZHScozzafava, ASupuran, CT Carbonic anhydrase inhibitors. Inhibition of cytosolic/tumor-associated carbonic anhydrase isozymes I, II, IX, and XII with Schiff's bases incorporating chromone and aromatic sulfonamide moieties, and their zinc complexes. Bioorg Med Chem Lett15:3096-101 (2005) 
 
Carbonic anhydrase 1
Name:Carbonic anhydrase 1
Type:Enzyme
Mol. Mass.:28873.37
Organism:Homo sapiens (Human)
Description:P00915
Residue:261
BDBM50167423
NameBDBM50167423
Synonyms:4-((6-methyl-4-oxo-4H-chromen-3-yl)methyleneamino)-6-(trifluoromethyl)benzene-1,3-disulfonamide CHEMBL196697
TypeSmall organic molecule
Emp. Form.C18H14F3N3O6S2
Mol. Mass.489.445
SMILESCc1ccc2occ(\C=N\c3cc(c(cc3S(N)(=O)=O)S(N)(=O)=O)C(F)(F)F)c(=O)c2c1