Reaction Details
TargetCarbonic anhydrase 1
LigandBDBM50167411
Substrate/Competitorn/a
Meas. Tech.ChEMBL_302503 (CHEMBL828219)
Ki 30±n/a nM
Citation Puccetti, LFasolis, GVullo, DChohan, ZHScozzafava, ASupuran, CT Carbonic anhydrase inhibitors. Inhibition of cytosolic/tumor-associated carbonic anhydrase isozymes I, II, IX, and XII with Schiff's bases incorporating chromone and aromatic sulfonamide moieties, and their zinc complexes. Bioorg Med Chem Lett15:3096-101 (2005) 
 
Carbonic anhydrase 1
Name:Carbonic anhydrase 1
Type:Enzyme
Mol. Mass.:28873.37
Organism:Homo sapiens (Human)
Description:P00915
Residue:261
BDBM50167411
NameBDBM50167411
Synonyms:4-(2-((6-methyl-4-oxo-4H-chromen-3-yl)methyleneamino)ethyl)benzenesulfonamide CHEMBL197031
TypeSmall organic molecule
Emp. Form.C19H18N2O4S
Mol. Mass.370.422
SMILESCc1ccc2occ(\C=N\CCc3ccc(cc3)S(N)(=O)=O)c(=O)c2c1