Reaction Details
TargetCarbonic anhydrase 2
LigandBDBM50167413
Substrate/Competitorn/a
Meas. Tech.ChEMBL_302531 (CHEMBL827383)
Ki 2.7±n/a nM
Citation Puccetti, LFasolis, GVullo, DChohan, ZHScozzafava, ASupuran, CT Carbonic anhydrase inhibitors. Inhibition of cytosolic/tumor-associated carbonic anhydrase isozymes I, II, IX, and XII with Schiff's bases incorporating chromone and aromatic sulfonamide moieties, and their zinc complexes. Bioorg Med Chem Lett15:3096-101 (2005) 
 
Carbonic anhydrase 2
Name:Carbonic anhydrase 2
Type:Enzyme
Mol. Mass.:29250.71
Organism:Homo sapiens (Human)
Description:P00918
Residue:260
BDBM50167413
NameBDBM50167413
Synonyms:CHEMBL372750 | sulfanilamide derivative
TypeSmall organic molecule
Emp. Form.C36H36Cl2N4O8S2Zn
Mol. Mass.853.138
SMILESNS(=O)(=O)c1ccc(CCN2CC3=COc4ccccc4C3O[Zn]22(Cl)(Cl)OC3C(CN2CCc2ccc(cc2)S(N)(=O)=O)=COc2ccccc32)cc1