Reaction Details
TargetHigh affinity nerve growth factor receptor
LigandBDBM50118955
Substrate/Competitorn/a
Meas. Tech.ChEMBL_306568 (CHEMBL832085)
IC50 1.2±n/a nM
Citation Gingrich, DEYang, SXGessner, GWAngeles, TSHudkins, RL Synthesis, modeling, and in vitro activity of (3'S)-epi-K-252a analogues. Elucidating the stereochemical requirements of the 3'-sugar alcohol on trkA tyrosine kinase activity. J Med Chem48:3776-83 (2005) 
 
High affinity nerve growth factor receptor
Name:High affinity nerve growth factor receptor
Type:n/a
Mol. Mass.:87498.18
Organism:Homo sapiens (Human)
Description:P04629
Residue:796
BDBM50118955
NameBDBM50118955
Synonyms:CHEMBL94678 | Compound K-252a(epi)
TypeSmall organic molecule
Emp. Form.C27H21N3O5
Mol. Mass.467.4727
SMILESCOC(=O)[C@]1(O)C[C@H]2O[C@]1(C)n1c3ccccc3c3c4CNC(=O)c4c4c5ccccc5n2c4c13