Reaction Details
TargetP2X purinoceptor 2
LigandBDBM50594505
Substrate/Competitorn/a
Meas. Tech.ChEMBL_2213099 (CHEMBL5126048)
EC50<100000±n/a nM
Citation Isaak, ADobelmann, CFüsser, FTErlitz, KSKoch, OJunker, A Unveiling the Structure-Activity Relationships at the Orthosteric Binding Site of P2X Ion Channels: The Route to Selectivity. J Med Chem65:11291-11308 (2022) 
 
P2X purinoceptor 2
Name:P2X purinoceptor 2
Type:Enzyme Catalytic Domain
Mol. Mass.:51765.18
Organism:Homo sapiens (Human)
Description:PurinergicP2X2/3 0 HUMAN::Q9UBL9
Residue:471
BDBM50594505
NameBDBM50594505
Synonyms:CHEMBL5177316
TypeSmall organic molecule
Emp. Form.C24H24N5O15P3
Mol. Mass.715.3931
SMILESNc1ncnc2n(cnc12)[C@@H]1O[C@H](COP(O)(=O)OP(O)(=O)OP(O)(O)=O)[C@@H](OC(=O)c2ccccc2)[C@H]1OC(=O)c1ccccc1