Reaction Details
TargetMelanin-concentrating hormone receptor 1
LigandBDBM50168631
Substrate/Competitorn/a
Meas. Tech.ChEMBL_303766 (CHEMBL829988)
Ki 4±n/a nM
Citation Rowbottom, MWVickers, TDDyck, BTamiya, JZhang, MZhao, LGrey, JProvencal, DSchwarz, DHeise, CEMistry, MFisher, ADong, THu, TSaunders, JGoodfellow, VS Synthesis and structure-activity relationships of biarylcarboxamide bis-aminopyrrolidine urea derived small-molecule antagonists of the melanin-concentrating hormone receptor-1 (MCH-R1). Bioorg Med Chem Lett15:3439-45 (2005) 
 
Melanin-concentrating hormone receptor 1
Name:Melanin-concentrating hormone receptor 1
Type:G Protein-Coupled Receptor (GPCR)
Mol. Mass.:45976.27
Organism:Homo sapiens (Human)
Description:Membranes from CHO-K1 cells stably expressing human MCH1R were used in assays.
Residue:422
BDBM50168631
NameBDBM50168631
Synonyms:(S)-3-{Methyl-[5-(4-trifluoromethoxy-phenyl)-thiophene-2-carbonyl]-amino}-pyrrolidine-1-carboxylic acid methyl-((R)-1-methyl-pyrrolidin-3-yl)-amide | CHEMBL363238
TypeSmall organic molecule
Emp. Form.C24H29F3N4O3S
Mol. Mass.510.572
SMILESCN([C@@H]1CCN(C)C1)C(=O)N1CC[C@@H](C1)N(C)C(=O)c1ccc(s1)-c1ccc(OC(F)(F)F)cc1