Reaction Details
TargetMelanin-concentrating hormone receptor 1
LigandBDBM50168801
Substrate/Competitorn/a
Meas. Tech.ChEMBL_302713 (CHEMBL839584)
Ki 122±n/a nM
Citation Guo, THunter, RCGu, HRokosz, LLStauffer, TMHobbs, DW Discovery and SAR of 4-amino-2-biarylbutylurea MCH 1 receptor antagonists through solid-phase parallel synthesis. Bioorg Med Chem Lett15:3691-5 (2005) 
 
Melanin-concentrating hormone receptor 1
Name:Melanin-concentrating hormone receptor 1
Type:G Protein-Coupled Receptor (GPCR)
Mol. Mass.:45976.27
Organism:Homo sapiens (Human)
Description:Membranes from CHO-K1 cells stably expressing human MCH1R were used in assays.
Residue:422
BDBM50168801
NameBDBM50168801
Synonyms:1-[4-Cyclopentylamino-2-(4-pyridin-4-yl-phenyl)-butyl]-3-(3,5-dichloro-phenyl)-urea | CHEMBL177981
TypeSmall organic molecule
Emp. Form.C27H30Cl2N4O
Mol. Mass.497.459
SMILESClc1cc(Cl)cc(NC(=O)NCC(CCNC2CCCC2)c2ccc(cc2)-c2ccncc2)c1