Reaction Details
TargetMelanin-concentrating hormone receptor 1
LigandBDBM50168814
Substrate/Competitorn/a
Meas. Tech.ChEMBL_302713 (CHEMBL839584)
Ki 7.4±n/a nM
Citation Guo, THunter, RCGu, HRokosz, LLStauffer, TMHobbs, DW Discovery and SAR of 4-amino-2-biarylbutylurea MCH 1 receptor antagonists through solid-phase parallel synthesis. Bioorg Med Chem Lett15:3691-5 (2005) 
 
Melanin-concentrating hormone receptor 1
Name:Melanin-concentrating hormone receptor 1
Type:G Protein-Coupled Receptor (GPCR)
Mol. Mass.:45976.27
Organism:Homo sapiens (Human)
Description:Membranes from CHO-K1 cells stably expressing human MCH1R were used in assays.
Residue:422
BDBM50168814
NameBDBM50168814
Synonyms:1-[2-(3'-Cyano-biphenyl-4-yl)-4-dimethylamino-butyl]-3-(4-fluoro-phenyl)-urea | CHEMBL175943
TypeSmall organic molecule
Emp. Form.C26H27FN4O
Mol. Mass.430.5172
SMILESCN(C)CCC(CNC(=O)Nc1ccc(F)cc1)c1ccc(cc1)-c1cccc(c1)C#N