Reaction Details
TargetDNA-dependent protein kinase catalytic subunit
LigandBDBM50594891
Substrate/Competitorn/a
Meas. Tech.ChEMBL_2214617 (CHEMBL5127749)
Ki<100±n/a nM
Citation Cheng, BPan, WXing, YXiao, YChen, JXu, Z Recent advances in DDR (DNA damage response) inhibitors for cancer therapy. Eur J Med Chem230:0 (2022) 
 
DNA-dependent protein kinase catalytic subunit
Name:DNA-dependent protein kinase catalytic subunit
Type:Protein
Mol. Mass.:469114.78
Organism:Homo sapiens (Human)
Description:P78527
Residue:4128
BDBM50594891
NameBDBM50594891
Synonyms:CHEMBL5171087
TypeSmall organic molecule
Emp. Form.C23H28N6O2
Mol. Mass.420.5074
SMILESC[C@@H]1CN(CCO1)c1cc(O[C@@H]2CC[C@@H](CC2)Nc2ncccn2)c2nccnc2c1