Reaction Details
TargetAndrogen receptor
LigandBDBM50594916
Substrate/Competitorn/a
Meas. Tech.ChEMBL_2214672 (CHEMBL5127804)
Ki 0.540000±n/a nM
Citation Xie, YTian, YZhang, YZhang, ZChen, RLi, MTang, JBian, JLi, ZXu, X Overview of the development of selective androgen receptor modulators (SARMs) as pharmacological treatment for osteoporosis (1998-2021). Eur J Med Chem230:0 (2022) 
 
Androgen receptor
Name:Androgen receptor
Type:Receptor
Mol. Mass.:99185.27
Organism:Homo sapiens (Human)
Description:CHO cells were stably transfected with human AR gene.
Residue:920
BDBM50594916
NameBDBM50594916
Synonyms:CHEMBL469759
TypeSmall organic molecule
Emp. Form.C18H14IN3O3
Mol. Mass.447.2265
SMILESC[C@@](O)(COc1ccc(cc1)C#N)C(=O)Nc1ccc(C#N)c(I)c1