Reaction Details
TargetAndrogen receptor
LigandBDBM50594917
Substrate/Competitorn/a
Meas. Tech.ChEMBL_2214672 (CHEMBL5127804)
Ki 4.0±n/a nM
Citation Xie, YTian, YZhang, YZhang, ZChen, RLi, MTang, JBian, JLi, ZXu, X Overview of the development of selective androgen receptor modulators (SARMs) as pharmacological treatment for osteoporosis (1998-2021). Eur J Med Chem230:0 (2022) 
 
Androgen receptor
Name:Androgen receptor
Type:Receptor
Mol. Mass.:99185.27
Organism:Homo sapiens (Human)
Description:CHO cells were stably transfected with human AR gene.
Residue:920
BDBM50594917
NameBDBM50594917
Synonyms:CHEMBL511130
TypeSmall organic molecule
Emp. Form.C19H18F3N3O6
Mol. Mass.441.3579
SMILESCC(=O)Nc1ccc(OC[C@@](C)(O)C(=O)Nc2ccc(c(c2)C(F)(F)F)[N+]([O-])=O)cc1