Reaction Details
TargetCathepsin D
LigandBDBM50169100
Substrate/Competitorn/a
Meas. Tech.ChEMBL_302506 (CHEMBL875212)
Ki 3.2±n/a nM
Citation Johansson, POLindberg, JBlackman, MJKvarnström, IVrang, LHamelink, EHallberg, ARosenquist, ASamuelsson, B Design and synthesis of potent inhibitors of plasmepsin I and II: X-ray crystal structure of inhibitor in complex with plasmepsin II. J Med Chem48:4400-9 (2005) 
 
Cathepsin D
Name:Cathepsin D
Type:Enzyme
Mol. Mass.:44551.72
Organism:Homo sapiens (Human)
Description:Human proCathepsin D (SwissProt accession number P07339) was expressed in Sf9 cells, purified, and autoactivated.
Residue:412
BDBM50169100
NameBDBM50169100
Synonyms:CHEMBL191260 | Pyridine-2-carboxylic acid {(S)-1-[(1S,2S)-3-[(S)-1-((S)-1-aminomethyl-3-methyl-butylcarbamoyl)-ethylcarbamoyl]-2-hydroxy-1-(4-thiophen-3-yl-benzyloxymethyl)-propylcarbamoyl]-2-methyl-propyl}-amide
TypeSmall organic molecule
Emp. Form.C36H48N6O7S
Mol. Mass.708.867
SMILESCC(C)C[C@H](NC(=O)[C@H](C)NC(=O)C[C@H](O)[C@H](COCc1ccc(cc1)-c1ccsc1)NC(=O)[C@@H](NC(=O)c1ccccn1)C(C)C)C(N)=O