Reaction Details
TargetPlasmepsin II
LigandBDBM50169104
Substrate/Competitorn/a
Meas. Tech.ChEMBL_302894 (CHEMBL830210)
Ki 1.9±n/a nM
Citation Johansson, POLindberg, JBlackman, MJKvarnström, IVrang, LHamelink, EHallberg, ARosenquist, ASamuelsson, B Design and synthesis of potent inhibitors of plasmepsin I and II: X-ray crystal structure of inhibitor in complex with plasmepsin II. J Med Chem48:4400-9 (2005) 
 
Plasmepsin II
Name:Plasmepsin II
Type:Enzyme
Mol. Mass.:51482.09
Organism:Plasmodium falciparum
Description:P46925
Residue:453
BDBM50169104
NameBDBM50169104
Synonyms:CHEMBL371417 | Pyridine-2-carboxylic acid {(S)-1-[(1S,2S)-3-[(S)-1-((S)-1-carbamoyl-3-methyl-butylcarbamoyl)-ethylcarbamoyl]-2-hydroxy-1-(3-thiophen-3-yl-benzyloxymethyl)-propylcarbamoyl]-2-methyl-propyl}-amide
TypeSmall organic molecule
Emp. Form.C36H48N6O7S
Mol. Mass.708.867
SMILESCC(C)C[C@H](NC(=O)[C@H](C)NC(=O)C[C@H](O)[C@H](COCc1cccc(c1)-c1ccsc1)NC(=O)[C@@H](NC(=O)c1ccccn1)C(C)C)C(N)=O