Reaction Details
TargetPlasmepsin I
LigandBDBM50169106
Substrate/Competitorn/a
Meas. Tech.ChEMBL_302875 (CHEMBL828789)
Ki 0.7±n/a nM
Citation Johansson, POLindberg, JBlackman, MJKvarnström, IVrang, LHamelink, EHallberg, ARosenquist, ASamuelsson, B Design and synthesis of potent inhibitors of plasmepsin I and II: X-ray crystal structure of inhibitor in complex with plasmepsin II. J Med Chem48:4400-9 (2005) 
 
Plasmepsin I
Name:Plasmepsin I
Type:Enzyme
Mol. Mass.:51463.30
Organism:Plasmodium falciparum
Description:n/a
Residue:452
BDBM50169106
NameBDBM50169106
Synonyms:CHEMBL363286 | Pyridine-2-carboxylic acid ((S)-1-{(1S,2S)-1-(biphenyl-3-ylmethoxymethyl)-3-[(S)-1-((S)-1-carbamoyl-3-methyl-butylcarbamoyl)-ethylcarbamoyl]-2-hydroxy-propylcarbamoyl}-2-methyl-propyl)-amide
TypeSmall organic molecule
Emp. Form.C38H50N6O7
Mol. Mass.702.8396
SMILESCC(C)C[C@H](NC(=O)[C@H](C)NC(=O)C[C@H](O)[C@H](COCc1cccc(c1)-c1ccccc1)NC(=O)[C@@H](NC(=O)c1ccccn1)C(C)C)C(N)=O