Reaction Details
TargetPlasmepsin I
LigandBDBM50169113
Substrate/Competitorn/a
Meas. Tech.ChEMBL_302875 (CHEMBL828789)
Ki 2.7±n/a nM
Citation Johansson, POLindberg, JBlackman, MJKvarnström, IVrang, LHamelink, EHallberg, ARosenquist, ASamuelsson, B Design and synthesis of potent inhibitors of plasmepsin I and II: X-ray crystal structure of inhibitor in complex with plasmepsin II. J Med Chem48:4400-9 (2005) 
 
Plasmepsin I
Name:Plasmepsin I
Type:Enzyme
Mol. Mass.:51463.30
Organism:Plasmodium falciparum
Description:n/a
Residue:452
BDBM50169113
NameBDBM50169113
Synonyms:CHEMBL371182 | Pyridine-2-carboxylic acid {(S)-1-[(1S,2S)-1-(4-benzo[1,3]dioxol-5-yl-benzyloxymethyl)-3-butylcarbamoyl-2-hydroxy-propylcarbamoyl]-2-methyl-propyl}-amide
TypeSmall organic molecule
Emp. Form.C34H42N4O7
Mol. Mass.618.7199
SMILESCCCCNC(=O)C[C@H](O)[C@H](COCc1ccc(cc1)-c1ccc2OCOc2c1)NC(=O)[C@@H](NC(=O)c1ccccn1)C(C)C