Reaction Details
TargetHistone deacetylase 2
LigandBDBM19410
Substrate/Competitorn/a
Meas. Tech.ChEMBL_2215800 (CHEMBL5128932)
Ki 6.0±n/a nM
Citation Moreno-Yruela, COlsen, CA Determination of Slow-Binding HDAC Inhibitor Potency and Subclass Selectivity. ACS Med Chem Lett13:779-785 (2022) 
 
Histone deacetylase 2
Name:Histone deacetylase 2
Type:Chromatin regulator; hydrolase; repressor
Mol. Mass.:55356.54
Organism:Homo sapiens (Human)
Description:Q92769
Residue:488
BDBM19410
NameBDBM19410
Synonyms:CHEMBL27759 US11377423, MS-275 US9265734, MS-275 benzamide-type inhibitor, 3 | pyridin-3-ylmethyl N-({4-[(2-aminophenyl)carbamoyl]phenyl}methyl)carbamate
TypeSmall organic molecule
Emp. Form.C21H20N4O3
Mol. Mass.376.4085
SMILESNc1ccccc1NC(=O)c1ccc(CNC(=O)OCc2cccnc2)cc1