Reaction Details
TargetHistone deacetylase 2
LigandBDBM50595205
Substrate/Competitorn/a
Meas. Tech.ChEMBL_2215800 (CHEMBL5128932)
Ki 31±n/a nM
Citation Moreno-Yruela, COlsen, CA Determination of Slow-Binding HDAC Inhibitor Potency and Subclass Selectivity. ACS Med Chem Lett13:779-785 (2022) 
 
Histone deacetylase 2
Name:Histone deacetylase 2
Type:Chromatin regulator; hydrolase; repressor
Mol. Mass.:55356.54
Organism:Homo sapiens (Human)
Description:Q92769
Residue:488
BDBM50595205
NameBDBM50595205
Synonyms:CHEMBL5195471
TypeSmall organic molecule
Emp. Form.C21H19FN4O
Mol. Mass.362.4002
SMILESNc1cc(F)ccc1NC(=O)C=Cc1cnn(CC=Cc2ccccc2)c1