Reaction Details
TargetHistone deacetylase 1
LigandBDBM50595205
Substrate/Competitorn/a
Meas. Tech.ChEMBL_2215807 (CHEMBL5128939)
Ki 2.0±n/a nM
Citation Moreno-Yruela, COlsen, CA Determination of Slow-Binding HDAC Inhibitor Potency and Subclass Selectivity. ACS Med Chem Lett13:779-785 (2022) 
 
Histone deacetylase 1
Name:Histone deacetylase 1
Type:Enzyme
Mol. Mass.:55090.27
Organism:Homo sapiens (Human)
Description:Q13547
Residue:482
BDBM50595205
NameBDBM50595205
Synonyms:CHEMBL5195471
TypeSmall organic molecule
Emp. Form.C21H19FN4O
Mol. Mass.362.4002
SMILESNc1cc(F)ccc1NC(=O)C=Cc1cnn(CC=Cc2ccccc2)c1