Reaction Details
TargetProstaglandin G/H synthase 2
LigandBDBM50056999
Substrate/Competitorn/a
Meas. Tech.ChEMBL_305496 (CHEMBL877006)
IC50 600±n/a nM
Citation Ottanà, RCarotti, SMaccari, RLandini, IChiricosta, GCaciagli, BVigorita, MGMini, E In vitro antiproliferative activity against human colon cancer cell lines of representative 4-thiazolidinones. Part I. Bioorg Med Chem Lett15:3930-3 (2005) 
 
Prostaglandin G/H synthase 2
Name:Prostaglandin G/H synthase 2
Type:Enzyme
Mol. Mass.:69003.89
Organism:Homo sapiens (Human)
Description:Recombinant Cox-2 provided by Cayman (Cayman Chemical Co.,Ann Arbor, MI).
Residue:604
BDBM50056999
NameBDBM50056999
Synonyms:CHEMBL56367 | nimesulide
TypeSmall organic molecule
Emp. Form.C13H12N2O5S
Mol. Mass.308.31
SMILESCS(=O)(=O)Nc1ccc(cc1Oc1ccccc1)[N+]([O-])=O