Reaction Details
TargetPotassium voltage-gated channel subfamily H member 2
LigandBDBM50169838
Substrate/Competitorn/a
Meas. Tech.ChEMBL_302272 (CHEMBL875187)
Ki 2446±n/a nM
Citation Fish, LRGilligan, MTHumphries, ACIvarsson, MLadduwahetty, TMerchant, KJO'Connor, DPatel, SPhilipps, EVargas, HMHutson, PHMacLeod, AM 4-Fluorosulfonylpiperidines: selective 5-HT2A ligands for the treatment of insomnia. Bioorg Med Chem Lett15:3665-9 (2005) 
 
Potassium voltage-gated channel subfamily H member 2
Name:Potassium voltage-gated channel subfamily H member 2
Type:Multi-pass membrane protein
Mol. Mass.:126672.65
Organism:Homo sapiens (Human)
Description:Q12809
Residue:1159
BDBM50169838
NameBDBM50169838
Synonyms:4-Benzenesulfonyl-1-[2-(2,4-difluoro-phenyl)-ethyl]-4-fluoro-piperidine | CHEMBL175586
TypeSmall organic molecule
Emp. Form.C19H20F3NO2S
Mol. Mass.383.428
SMILESFc1ccc(CCN2CCC(F)(CC2)S(=O)(=O)c2ccccc2)c(F)c1